{"text_format":"1","workbook":"xlsx","n_sheets":35,"sheets":["Introduction","STEPS","DISCLAIMER","INPUT - DATA","MODEL ASSUMPTIONS","IMPACT","SUMMARY TAB","General Fund Impact - Alt 1","General Fund Impact - Alt 2","General Fund Impact - Alt 3","General Fund Impact - Alt 4","REVENUE DETAIL","EXPENSE DETAIL","T12 Est Cty Expen","T12 Est Cty Expen (COMPACT)","T7 Other Cty Revs","T13 Expense Per Acre","T11 Revenues Per Acre","T8 Est Prop Tax","T8 Est Prop Tax (Annex)","T8 Est Prop Tax (Annex Is)","T9 Est Sales Tax","T10 Est Prop Transfer","T1 Placetype Assumptions","T5 Dev Prog","All City EXP REV Data","T4 Fiscal Factors","Property Price","Turlock Budget Input","Check Sheet","T14 GF Analysis","T20 Services Mitigation Fee","Incremental Value","TURLOCK SPECIFIC INPUT","T122 GF Analysis"],"not_rendered":{"charts":20,"images":5,"macros":0,"external_links":6,"defined_names":143,"comments":3,"pivot_tables":0},"unopened":[],"bounds":{"document_bytes":16777216,"sheet_cells":100000,"rows_first":2000,"rows_last":500,"rows_between":2000,"halvings":0,"cell_chars":16384,"cell_head_chars":4096},"cells_cut":0,"cells_raw":0,"read":"whole","date_system":"1900"}

{"sheet":"Introduction","index":0,"n_rows":0,"n_cols":0,"rows_kept":0,"cut":false,"hidden":false,"merged":[[1,0,1,1]]}

{"sheet":"STEPS","index":1,"n_rows":0,"n_cols":0,"rows_kept":0,"cut":false,"hidden":false,"merged":[[1,0,1,1]]}

{"sheet":"DISCLAIMER","index":2,"n_rows":0,"n_cols":0,"rows_kept":0,"cut":false,"hidden":false,"merged":[[1,0,1,1]]}

{"sheet":"INPUT - DATA","index":3,"n_rows":1495,"n_cols":48,"rows_kept":1495,"cut":false,"hidden":false,"merged":[[28,44,28,47],[27,44,27,47],[27,32,27,36],[28,33,28,36],[81,1,81,4],[28,13,28,17],[28,8,28,11],[59,1,59,5],[59,7,59,11],[27,38,27,42],[28,39,28,42],[28,21,28,24],[27,26,27,30],[28,27,28,30],[27,20,27,24],[13,1,13,6],[14,3,14,6],[527,1,527,5],[477,1,477,6],[478,3,478,6],[486,1,486,6],[487,3,487,6],[517,1,517,5],[159,1,159,2],[166,1,166,2],[1477,1,1477,5],[1489,1,1489,2],[20,3,20,6],[19,1,19,6],[28,3,28,6],[27,1,27,6]]}
[]
[]
[null,"Jurisdiction"]
[null,"Turlock"]
[]
[]
{"$rows_left_out":1490}
{"sheet":"MODEL ASSUMPTIONS","index":4,"n_rows":498,"n_cols":9,"rows_kept":498,"cut":false,"hidden":false,"merged":[[29,1,29,2],[36,1,36,3],[56,1,56,2],[45,1,45,3]]}
[]
[]
[null,"Expenditure Variability per Growth in Service Population"]
[null,"Expenditure Category","% Variable"]
[null,"General Government ",0.5]
[null,"Public Safety ",0.9]
{"$rows_left_out":493}
{"sheet":"IMPACT","index":5,"n_rows":46,"n_cols":5,"rows_kept":46,"cut":false,"hidden":false,"merged":[[3,1,3,4],[27,1,27,4]]}
[]
[]
[]
[null,"Net Revenue per Acre by Land Use"]
[null,"Land Use Category","Total Revenue/Acre","Total Expenses/Acre","Net Revenue/Acre"]
[null,{"$f":"'T14 GF Analysis'!A7","v":" Rural Residential  "},{"$f":"'T11 Revenues Per Acre'!J7","v":178.8832287962245},{"$f":"'T13 Expense Per Acre'!G7","v":497.17253288043486},{"$f":"C6-D6","v":-318.28930408421036}]
{"$rows_left_out":41}
{"sheet":"SUMMARY TAB","index":6,"n_rows":33,"n_cols":10,"rows_kept":33,"cut":false,"hidden":false,"merged":[[2,1,2,5]]}
[]
[]
[null,"Net General Fund Impact of Development Alternatives"]
[]
[null,"Land Use",{"$f":"'INPUT - DATA'!D17","v":"Alternative A"},{"$f":"'INPUT - DATA'!E17","v":"Alternative B"},{"$f":"IF('INPUT - DATA'!F17=0,\"NA\",'INPUT - DATA'!F17)","v":"Alternative C"},{"$f":"IF('INPUT - DATA'!G17=0,\"NA\",'INPUT - DATA'!G17)","v":"Alternative D"}]
[null,"Acreage (Urban Uses)",{"$f":"SUM('INPUT - DATA'!D31:D47)","v":2500.7999999999997},{"$f":"SUM('INPUT - DATA'!E31:E47)","v":2773.9000000000005},{"$f":"SUM('INPUT - DATA'!F31:F47)","v":2397.8999999999996},{"$f":"SUM('INPUT - DATA'!G31:G47)","v":3029.7}]
{"$rows_left_out":28}
{"sheet":"General Fund Impact - Alt 1","index":7,"n_rows":73,"n_cols":52,"rows_kept":73,"cut":false,"hidden":false,"merged":[[1,0,1,1]]}
[]
["  ALTERNATIVE 1"]
[{"$f":"'INPUT - DATA'!$B$11","v":2030}]
[null,"FISCAL PERFORMANCE"]
[]
[null,"Net General Fund Impact of Alternative"]
{"$rows_left_out":68}
{"sheet":"General Fund Impact - Alt 2","index":8,"n_rows":73,"n_cols":53,"rows_kept":73,"cut":false,"hidden":false,"merged":[[1,0,1,1]]}
[]
["  ALTERNATIVE 2"]
[{"$f":"'INPUT - DATA'!$B$11","v":2030}]
[null,"FISCAL PERFORMANCE"]
[]
[null,"Net General Fund Impact of Alternative"]
{"$rows_left_out":68}
{"sheet":"General Fund Impact - Alt 3","index":9,"n_rows":73,"n_cols":53,"rows_kept":73,"cut":false,"hidden":false,"merged":[[1,0,1,1]]}
[]
["  ALTERNATIVE 3"]
[{"$f":"'INPUT - DATA'!$B$11","v":2030}]
[null,"FISCAL PERFORMANCE"]
[]
[null,"Net General Fund Impact of Alternative"]
{"$rows_left_out":68}
{"sheet":"General Fund Impact - Alt 4","index":10,"n_rows":73,"n_cols":53,"rows_kept":73,"cut":false,"hidden":false,"merged":[[1,0,1,1]]}
[]
["  ALTERNATIVE 4"]
[{"$f":"'INPUT - DATA'!$B$11","v":2030}]
[null,"FISCAL PERFORMANCE"]
[]
[null,"Net General Fund Impact of Alternative"]
{"$rows_left_out":68}
{"sheet":"REVENUE DETAIL","index":11,"n_rows":134,"n_cols":49,"rows_kept":134,"cut":false,"hidden":false,"merged":[]}
[]
[]
[null,"General Fund Revenue per Development Alternative by Land Use Category"]
[]
[null,"Property Taxes"]
[null,"Land Use Category","Property Tax per Acre\n (Non-Annex)","Property Tax per Acre\n (Annex New)","Property Tax per Acre\n (Annex Island)",{"$f":"'INPUT - DATA'!$D$22","v":"Alternative A"},{"$f":"'INPUT - DATA'!$E$22","v":"Alternative B"},{"$f":"'INPUT - DATA'!$F$22","v":"Alternative C"},{"$f":"'INPUT - DATA'!$G$22","v":"Alternative D"},null,null,null,null,null,null,null,null,null,null,null,null,null,null,null,null,null,null,null,null,null,null,null,null,null,null,null,null,null,null,null,null,null,null,null,null,null,null,null,"Existing"]
{"$rows_left_out":129}
{"sheet":"EXPENSE DETAIL","index":12,"n_rows":23,"n_cols":13,"rows_kept":23,"cut":false,"hidden":false,"merged":[[2,1,2,7]]}
[]
[]
[null,"General Fund Expenditure per Development Alternative by Land Use Category"]
[]
[null,"Land Use Category","Expenditure \nper Acre","Existing",{"$f":"'INPUT - DATA'!$D$22","v":"Alternative A"},{"$f":"'INPUT - DATA'!$E$22","v":"Alternative B"},{"$f":"'INPUT - DATA'!$F$22","v":"Alternative C"},{"$f":"'INPUT - DATA'!$G$22","v":"Alternative D"}]
[null," Rural Residential  ",{"$f":"'T13 Expense Per Acre'!G7","v":497.17253288043486},{"$f":"$C6*'INPUT - DATA'!C31","v":299148.7130341577},{"$f":"$C6*'INPUT - DATA'!D31","v":0},{"$f":"$C6*'INPUT - DATA'!E31","v":9147.9746050000012},{"$f":"$C6*'INPUT - DATA'!F31","v":9147.9746050000012},{"$f":"$C6*'INPUT - DATA'!G31","v":9147.9746050000012}]
{"$rows_left_out":18}
{"sheet":"T12 Est Cty Expen","index":13,"n_rows":21,"n_cols":10,"rows_kept":21,"cut":false,"hidden":false,"merged":[[4,4,4,5],[4,6,4,7],[17,0,17,1],[4,1,5,1],[4,2,5,2],[4,3,5,3]]}
[]
["City Expenditures per Resident and Employee (Standard Development)"]
["Expenditures",{"$f":"'INPUT - DATA'!B8","v":2010}]
[]
[null,"Baseline FY Expenditures","% Variable","Variable Cost","Service Population Factors",null,"Expenditures per Capita"]
["Category",null,null,null,"Resident","Employee","Resident","Employee"]
{"$rows_left_out":16}
{"sheet":"T12 Est Cty Expen (COMPACT)","index":14,"n_rows":21,"n_cols":9,"rows_kept":21,"cut":false,"hidden":false,"merged":[[4,7,4,8],[17,0,17,1],[4,6,5,6],[4,1,5,1],[4,2,5,2],[4,3,5,3],[4,4,4,5]]}
[]
["City Expenditures per Resident and Employee (Compact Development)"]
["Expenditures",{"$f":"'INPUT - DATA'!B8","v":2010}]
[]
[null,"Baseline FY Expenditures","% Variable","Variable Cost","Service Population Factors",null,"Compact Efficiency Factor","Expenditures per Capita"]
["Category",null,null,null,"Resident","Employee",null,"Resident","Employee"]
{"$rows_left_out":16}
{"sheet":"T7 Other Cty Revs","index":15,"n_rows":22,"n_cols":8,"rows_kept":22,"cut":false,"hidden":false,"merged":[[16,0,16,7],[4,2,5,2],[18,0,18,1],[4,1,5,1],[4,4,4,5],[4,6,4,7],[4,3,5,3]]}
[]
["Other Reccuring City Revenues per Resident and Employee"]
["Expenditures",{"$f":"'INPUT - DATA'!B8","v":2010}]
[]
[null,"Baseline FY \nRevenues","% Variable","Variable Revenue","Service Population Factors",null,"Revenues per Capita"]
["Revenue Item",null,null,null,"Resident","Employee","Resident","Employee"]
{"$rows_left_out":17}
{"sheet":"T13 Expense Per Acre","index":16,"n_rows":26,"n_cols":7,"rows_kept":26,"cut":false,"hidden":false,"merged":[]}
["Table 13"]
["Total Estimated Expenses"]
[{"$f":"'[1]T2 Dev Assumptions'!A3","v":"SACOG Fiscal Model"}]
[]
["Development Type","Standard or Compact \nDevelopment","Expenditure Per Resident","Residents\nPer Acre","Expenditure Per Employee","Employees\nPer Acre","Total Expenses\nPer Acre"]
[]
{"$rows_left_out":21}
{"sheet":"T11 Revenues Per Acre","index":17,"n_rows":33,"n_cols":10,"rows_kept":33,"cut":false,"hidden":false,"merged":[]}
["Table 11"]
["Total Estimated Revenues"]
[]
[]
[null,"Land Use Category","Other Recurring Revenue Per Resident","Residents Per Acre","Other Recurring Revenue Per Employee","Employees\nPer Acre","Total Other Recurring Revenue\nPer Acre","Tax Revenue\nPer Acre","Services Mitigation Fees Per Acre","Total Revenue\nPer Acre"]
[]
{"$rows_left_out":28}
{"sheet":"T8 Est Prop Tax","index":18,"n_rows":25,"n_cols":8,"rows_kept":25,"cut":false,"hidden":false,"merged":[]}
["Table 8"]
["Estimated Property Tax Revenues (per acre) by Typology (Land Within City)"]
[{"$f":"'T5 Dev Prog'!A3","v":"StanCOG Fiscal Model"}]
["Land Use","Residential Square Feet\nPer Acre","Residential Value\nPer Acre","Commercial Square Feet\nPer Acre","Commercial Value\nPer Acre","Total Value per Acre","Tax Rate","Total Property Tax Revenue\nPer Acre"]
[]
[{"$f":"'T1 Placetype Assumptions'!A11","v":" Rural Residential  "},{"$f":"'T1 Placetype Assumptions'!C11","v":750},{"$f":"B6*'MODEL ASSUMPTIONS'!D$50","v":91646.920870080823},{"$f":"'T1 Placetype Assumptions'!E11","v":0},{"$f":"D6*0","v":0},{"$f":"E6+C6","v":91646.920870080823},{"$f":"'MODEL ASSUMPTIONS'!$C$62*'MODEL ASSUMPTIONS'!$C$63","v":1E-3},{"$f":"G6*F6","v":91.64692087008082}]
{"$rows_left_out":20}
{"sheet":"T8 Est Prop Tax (Annex)","index":19,"n_rows":25,"n_cols":10,"rows_kept":25,"cut":false,"hidden":false,"merged":[]}
["Table 8"]
["Estimated Property Tax Revenues (per acre) by Typology (New County Land Annexed)"]
[{"$f":"'T5 Dev Prog'!A3","v":"StanCOG Fiscal Model"}]
["Land Use","Residential Square Feet\nPer Acre","Residential Value\nPer Acre","Commercial Square Feet\nPer Acre","Commercial Value\nPer Acre","Total Value per Acre","Pre-Annexation Base Value \nper Acre","Incremental Value \nper Acre","Tax Rate","Total Property Tax Revenue\nPer Acre"]
[]
[{"$f":"'T1 Placetype Assumptions'!A11","v":" Rural Residential  "},{"$f":"'T1 Placetype Assumptions'!C11","v":750},{"$f":"B6*'MODEL ASSUMPTIONS'!D$50","v":91646.920870080823},{"$f":"'T1 Placetype Assumptions'!E11","v":0},{"$f":"D6*0","v":0},{"$f":"E6+C6","v":91646.920870080823},{"$f":"'MODEL ASSUMPTIONS'!$C$58","v":30000},{"$f":"F6-G6","v":61646.920870080823},{"$f":"'MODEL ASSUMPTIONS'!$C$62*'MODEL ASSUMPTIONS'!$C$64*'MODEL ASSUMPTIONS'!$C$65","v":3.3E-4},{"$f":"I6*H6","v":20.34348388712667}]
{"$rows_left_out":20}
{"sheet":"T8 Est Prop Tax (Annex Is)","index":20,"n_rows":25,"n_cols":8,"rows_kept":25,"cut":false,"hidden":false,"merged":[]}
["Table 8"]
["Estimated Property Tax Revenues (per acre) by Typology (County Urban Island Annexed)"]
[{"$f":"'T5 Dev Prog'!A3","v":"StanCOG Fiscal Model"}]
["Land Use","Residential Square Feet\nPer Acre","Residential Value\nPer Acre","Commercial Square Feet\nPer Acre","Commercial Value\nPer Acre","Total Value per Acre","County Tax Rate","Total Property Tax Revenue\nPer Acre"]
[]
[{"$f":"'T1 Placetype Assumptions'!A11","v":" Rural Residential  "},{"$f":"'T1 Placetype Assumptions'!C11","v":750},{"$f":"B6*'MODEL ASSUMPTIONS'!D$50","v":91646.920870080823},{"$f":"'T1 Placetype Assumptions'!E11","v":0},{"$f":"D6*0","v":0},{"$f":"E6+C6","v":91646.920870080823},{"$f":"'MODEL ASSUMPTIONS'!$C$62*'MODEL ASSUMPTIONS'!$C$63*'MODEL ASSUMPTIONS'!$C$67","v":3.4000000000000002E-4},{"$f":"G6*F6","v":31.159953095827483}]
{"$rows_left_out":20}
{"sheet":"T9 Est Sales Tax","index":21,"n_rows":71,"n_cols":8,"rows_kept":71,"cut":false,"hidden":false,"merged":[]}
["Table 9"]
["Estimated Sales Tax Revenues"]
[{"$f":"'[1]T2 Dev Assumptions'!A3","v":"SACOG Fiscal Model"}]
[]
["Land Use",null,"Retail Square Feet per Acre","Taxable Retail Sales Per Square Foot","Office Square Feet per Acre","Taxable Business to Business Sales Per Square Foot","Sales Tax Rate","Total Sales Taxes per Acre"]
[]
{"$rows_left_out":66}
{"sheet":"T10 Est Prop Transfer","index":22,"n_rows":27,"n_cols":7,"rows_kept":27,"cut":false,"hidden":false,"merged":[]}
["Table 10"]
["Annual Estimated Real Property Transfer Tax Revenues"]
[{"$f":"'[1]T2 Dev Assumptions'!A3","v":"SACOG Fiscal Model"}]
[]
["Real Property Transfer Tax Estimate",null,"Assessed Value","Average Turnover Period","AV Turnover Per Year","Transfer Tax Rate","Annual Transfer Tax"]
[]
{"$rows_left_out":22}
{"sheet":"T1 Placetype Assumptions","index":23,"n_rows":37,"n_cols":17,"rows_kept":37,"cut":false,"hidden":false,"merged":[[36,1,36,2]]}
["Table 1"]
["Land Use Typology Assumptions and Summary Results"]
["StanCOG Fiscal Model"]
["Land Use Source: INPUT tab"]
[]
[]
{"$rows_left_out":32}
{"sheet":"T5 Dev Prog","index":24,"n_rows":33,"n_cols":11,"rows_kept":33,"cut":false,"hidden":false,"merged":[]}
["Table 1"]
["Development Types","Note: All Values are per 1 acre"]
[{"$f":"'T4 Fiscal Factors'!A3","v":"StanCOG Fiscal Model"}]
[]
["Land Use","Residential Units\nper Acre","Commercial Square Feet\nper Acre","Retail Square Feet\nper Acre","Residents\nper Acre","Employees\nper Acre","Service Population \nper Acre"]
[]
{"$rows_left_out":28}
{"sheet":"All City EXP REV Data","index":25,"n_rows":866,"n_cols":14,"rows_kept":866,"cut":false,"hidden":false,"merged":[]}
[null,"City","Statement","Category","Revenue Account "," Functional Revenues"," General Revenues"," Total Revenues ","Operating Expenditures","Provider Code","Capital Outlay","Total Expenditures","Functional Revenues","Net Expenditures"]
[]
[null,"Ceres","Revenues",{"$f":"IF('T11 Revenues Per Acre'!$B$30=0,\"Taxes\",\"Omitted\")","v":"Omitted"},"Secured and Unsecured Property Tax",0,1816135,1816135]
[null,"Ceres","Revenues",{"$f":"IF('T11 Revenues Per Acre'!$B$30=0,\"Taxes\",\"Omitted\")","v":"Omitted"},"Voter Approved Indebtedness Property Tax",0,0,0]
[null,"Ceres","Revenues",{"$f":"IF('T11 Revenues Per Acre'!$B$30=0,\"Taxes\",\"Omitted\")","v":"Omitted"},"Other Property Taxes",0,2744956,2744956]
[null,"Ceres","Revenues",{"$f":"IF('T11 Revenues Per Acre'!$B$30=0,\"Taxes\",\"Omitted\")","v":"Omitted"},"Sales and Use Taxes",0,2853255,2853255]
{"$rows_left_out":861}
{"sheet":"T4 Fiscal Factors","index":26,"n_rows":67,"n_cols":22,"rows_kept":67,"cut":false,"hidden":false,"merged":[]}
["Table 4"]
["Budget Factors"]
[{"$f":"'T1 Placetype Assumptions'!A3","v":"StanCOG Fiscal Model"}]
[]
["Item",null,"Jurisdiction"]
[null,null,{"$f":"'INPUT - DATA'!B4","v":"Turlock"}]
{"$rows_left_out":62}
{"sheet":"Property Price","index":27,"n_rows":43,"n_cols":15,"rows_kept":43,"cut":false,"hidden":false,"merged":[]}
[]
[null,null,"Price ",null,null,null,null,null,null,null,"Type","Sale $/SF"]
[null,null,360000,2225,{"$f":"C3/D3","v":161.79775280898878},"office","turlock ",null,null,null,"retail",124,"http://www.ctbt.com/Web/Download-Research-File.aspx?id=9001C012-1D91-41EA-B89D-3824C02076CC"]
[null,null,525000,4400,{"$f":"C4/D4","v":119.31818181818181},"office","turlock ",null,null,null,"office",90,"http://www.ctbt.com/Web/Download-Research-File.aspx?id=9001C012-1D91-41EA-B89D-3824C02076CC"]
[null,null,699000,2430,230,"retail","ceres","bank",null,null,"warehouse",49,"http://www.ctbt.com/Web/Download-Research-File.aspx?id=9001C012-1D91-41EA-B89D-3824C02076CC"]
[null,null,337000,4700,{"$f":"C6/D6","v":71.702127659574472},"retail","ceres"]
{"$rows_left_out":38}
{"sheet":"Turlock Budget Input","index":28,"n_rows":8,"n_cols":8,"rows_kept":8,"cut":false,"hidden":false,"merged":[]}
[null,null,null,null,"Program Revenues"]
[null,"﻿Governmental activities: ","Expenses","Charges for Services","Operating Grants and Contributions","Capital Grants and Contributions"," "]
[null,"General Government ",3956620,3557335,87465,238584,{"$f":"C3","v":3956620},{"$f":"C3-D3-E3","v":311820}]
[null,"Public Safety ",26204325,2110880,1018661,284373,{"$f":"C4","v":26204325},{"$f":"C4-D4-E4","v":23074784}]
[null,"Public Ways and Facilities/Transportation ",11272363,3094804,1727201,4797325,{"$f":"C5","v":11272363},6450358]
[null,"Culture and Recreation ",4296813,1579969,509104,398779,{"$f":"C6","v":4296813},2207740]
{"$rows_left_out":3}
{"sheet":"Check Sheet","index":29,"n_rows":75,"n_cols":13,"rows_kept":75,"cut":false,"hidden":false,"merged":[]}
[]
[]
[null,"Revenue"]
[]
[null,"Land Use Category","Existing",{"$f":"'INPUT - DATA'!$D$22","v":"Alternative A"},{"$f":"'INPUT - DATA'!$E$22","v":"Alternative B"},{"$f":"'INPUT - DATA'!$F$22","v":"Alternative C"},{"$f":"'INPUT - DATA'!$G$22","v":"Alternative D"}]
[null," Rural Residential  ",{"$f":"'T11 Revenues Per Acre'!$J7*'INPUT - DATA'!C31","v":107634.03876668829},{"$f":"'T11 Revenues Per Acre'!$J7*'INPUT - DATA'!D31","v":0},{"$f":"'T11 Revenues Per Acre'!$J7*'INPUT - DATA'!E31","v":3291.4514098505306},{"$f":"'T11 Revenues Per Acre'!$J7*'INPUT - DATA'!F31","v":3291.4514098505306},{"$f":"'T11 Revenues Per Acre'!$J7*'INPUT - DATA'!G31","v":3291.4514098505306}]
{"$rows_left_out":70}
{"sheet":"T14 GF Analysis","index":30,"n_rows":27,"n_cols":4,"rows_kept":27,"cut":false,"hidden":false,"merged":[]}
["Table 14"]
["General Fund Impact Analysis by Type"]
[{"$f":"'T1 Placetype Assumptions'!A3","v":"StanCOG Fiscal Model"}]
[null,"Total Revenue","Total Expenses","Net Revenues"]
[]
[]
{"$rows_left_out":22}
{"sheet":"T20 Services Mitigation Fee","index":31,"n_rows":23,"n_cols":10,"rows_kept":23,"cut":false,"hidden":false,"merged":[]}
[]
["Estimated Services Mitigation Fee Revenues (per acre) by Typology"]
[]
[]
["Land Use","Residential Unit Class","Non-Residential Class","Residential Units\nper Acre","Commercial Square Feet\nper Acre","Residential Service Mitigation Fee per Unit","Non-Residential Service Mitigation Fee per Sq Ft","Residential Service Mitigation Fee per Acre","Non-Residential Service Mitigation Fee per Acre","Total Service Mitigation Fee per Acre"]
[]
{"$rows_left_out":18}
{"sheet":"Incremental Value","index":32,"n_rows":36,"n_cols":15,"rows_kept":36,"cut":false,"hidden":false,"merged":[]}
[]
[null,null,null,null,null,null,null,null,null,null,null,"Jurisdiction","Increase in Land Value"]
[null,null,"Values",null,null,null,null,null,null,null,null,{"$f":"'INPUT - DATA'!B4","v":"Turlock"},{"$f":"VLOOKUP(L3,$L$5:$M$14,2,FALSE)","v":0.10293218095861786}]
[null,"City","Sum of Current Mar Value","Sum of AcresGIS Acres","Land Value per Acre"]
[null,"Ceres",null,null,null,null,null,null,null,null,null,"Ceres",{"$f":"I6","v":0.22715429770120257},null,1.5]
[null,"Within City",641049427,4021.8725738519784,{"$f":"C6/D6","v":159390.78507055488},{"$f":"E6/E7","v":6.6034409878218154},null,{"$f":"E6/$O$5","v":106260.52338036992},{"$f":"E7/H6","v":0.22715429770120257},null,null,"Hughson",{"$f":"I9","v":0.11732453699746377}]
{"$rows_left_out":31}
{"sheet":"TURLOCK SPECIFIC INPUT","index":33,"n_rows":41,"n_cols":3,"rows_kept":41,"cut":false,"hidden":true,"merged":[[2,1,2,2]]}
[]
[]
[null,"Roadway Infrastructure O&M Costs per Acre Data"]
[null,"Annual Street Repairs Budget",1391173]
[null,"Annual Street Sweeping Budget",252083]
[null,"Annual Streetlighting Budget",107545]
{"$rows_left_out":36}
{"sheet":"T122 GF Analysis","index":34,"n_rows":27,"n_cols":4,"rows_kept":27,"cut":false,"hidden":true,"merged":[]}
["Table 14"]
["General Fund Impact Analysis by Type"]
[{"$f":"'T1 Placetype Assumptions'!A3","v":"StanCOG Fiscal Model"}]
[null,"Total Revenue","Total Expenses","Net Revenues"]
[]
[]
{"$rows_left_out":21}